Target
Endoplasmic reticulum aminopeptidase 1
Ligand
BDBM50190114
Substrate
Meas. Tech.
ChEBML_1591201
Ki
249000±n/a nM
Citation
 Weglarz-Tomczak, EVassiliou, SMucha, A Discovery of potent and selective inhibitors of human aminopeptidases ERAP1 and ERAP2 by screening libraries of phosphorus-containing amino acid and dipeptide analogues. Bioorg Med Chem Lett 26:4122-6 (2016)  
Target
Name:
Endoplasmic reticulum aminopeptidase 1
Synonyms:
APPILS Aminopeptidase ERAP1_HUMAN | KIAA0525
Type:
PROTEIN
Mol. Mass.:
107232.03
Organism:
Homo sapiens (Human)
Description:
ChEMBL_1473167
Residue:
941
  
Inhibitor
Name:
BDBM50190114
Synonyms:
CHEMBL288165
Type:
Small organic molecule
Emp. Form.:
C5H14NO3P
Mol. Mass.:
167.1433
SMILES:
CC(C)C[C@@H](N)P(O)(O)=O
: