Target
Endoplasmic reticulum aminopeptidase 1
Ligand
BDBM50025047
Substrate
Meas. Tech.
ChEBML_1591201
Ki
31600±n/a nM
Citation
 Weglarz-Tomczak, EVassiliou, SMucha, A Discovery of potent and selective inhibitors of human aminopeptidases ERAP1 and ERAP2 by screening libraries of phosphorus-containing amino acid and dipeptide analogues. Bioorg Med Chem Lett 26:4122-6 (2016)  
Target
Name:
Endoplasmic reticulum aminopeptidase 1
Synonyms:
APPILS Aminopeptidase ERAP1_HUMAN | KIAA0525
Type:
PROTEIN
Mol. Mass.:
107232.03
Organism:
Homo sapiens (Human)
Description:
ChEMBL_1473167
Residue:
941
  
Inhibitor
Name:
BDBM50025047
Synonyms:
CHEMBL3355100
Type:
Small organic molecule
Emp. Form.:
C21H28NO4P
Mol. Mass.:
389.4251
SMILES:
Cc1cc(C)cc(CCC(N)P(O)(=O)CC(Cc2ccccc2)C(O)=O)c1
: