Target
Endoplasmic reticulum aminopeptidase 1
Ligand
BDBM50170875
Substrate
Meas. Tech.
ChEBML_1591201
Ki
>250000±n/a nM
Citation
 Weglarz-Tomczak, EVassiliou, SMucha, A Discovery of potent and selective inhibitors of human aminopeptidases ERAP1 and ERAP2 by screening libraries of phosphorus-containing amino acid and dipeptide analogues. Bioorg Med Chem Lett 26:4122-6 (2016)  
Target
Name:
Endoplasmic reticulum aminopeptidase 1
Synonyms:
APPILS Aminopeptidase ERAP1_HUMAN | KIAA0525
Type:
PROTEIN
Mol. Mass.:
107232.03
Organism:
Homo sapiens (Human)
Description:
ChEMBL_1473167
Residue:
941
  
Inhibitor
Name:
BDBM50170875
Synonyms:
CHEMBL3805288
Type:
Small organic molecule
Emp. Form.:
C9H16N3O3P
Mol. Mass.:
245.2154
SMILES:
NC(CNCc1ccc(N)cc1)P(O)(O)=O
: