Target
Endoplasmic reticulum aminopeptidase 2
Ligand
BDBM50025045
Substrate
Meas. Tech.
ChEBML_1591204
Ki
4570±n/a nM
Citation
 Weglarz-Tomczak, EVassiliou, SMucha, A Discovery of potent and selective inhibitors of human aminopeptidases ERAP1 and ERAP2 by screening libraries of phosphorus-containing amino acid and dipeptide analogues. Bioorg Med Chem Lett 26:4122-6 (2016)  
Target
Name:
Endoplasmic reticulum aminopeptidase 2
Synonyms:
Aminopeptidase ERAP2_HUMAN | LRAP
Type:
PROTEIN
Mol. Mass.:
110463.90
Organism:
Homo sapiens (Human)
Description:
ChEMBL_1473169
Residue:
960
  
Inhibitor
Name:
BDBM50025045
Synonyms:
CHEMBL3355102
Type:
Small organic molecule
Emp. Form.:
C19H24NO5P
Mol. Mass.:
377.3713
SMILES:
NC(CCc1cccc(O)c1)P(O)(=O)CC(Cc1ccccc1)C(O)=O
: