Target
Receptor tyrosine-protein kinase erbB-2
Ligand
BDBM50190728
Substrate
Meas. Tech.
ChEBML_1612510
IC50
1600±n/a nM
Citation
 Yin, STang, CWang, BZhang, YZhou, LXue, LZhang, C Design, synthesis and biological evaluation of novel EGFR/HER2 dual inhibitors bearing a oxazolo[4,5-g]quinazolin-2(1H)-one scaffold. Eur J Med Chem 120:26-36 (2016)  
Target
Name:
Receptor tyrosine-protein kinase erbB-2
Synonyms:
2.7.10.1 CD_antigen=CD340 ERBB2_HUMAN FASN/HER2 HER2 MLN19 NEU Proto-oncogene Neu Tyrosine kinase-type cell surface receptor HER2 | p185erbB2
Type:
Mol. Mass.:
137894.47
Organism:
Homo sapiens (Human)
Description:
P04626
Residue:
1255
  
Inhibitor
Name:
BDBM50190728
Synonyms:
CHEMBL3940060
Type:
Small organic molecule
Emp. Form.:
C19H13Cl2FN4O4
Mol. Mass.:
451.235
SMILES:
Fc1ccc(Nc2ncnc3cc4oc(=O)n(CCOC(=O)CCl)c4cc23)cc1Cl
: