Target
Receptor tyrosine-protein kinase erbB-2
Ligand
BDBM50190803
Substrate
Meas. Tech.
ChEBML_1612510
IC50
35±n/a nM
Citation
 Yin, STang, CWang, BZhang, YZhou, LXue, LZhang, C Design, synthesis and biological evaluation of novel EGFR/HER2 dual inhibitors bearing a oxazolo[4,5-g]quinazolin-2(1H)-one scaffold. Eur J Med Chem 120:26-36 (2016)  
Target
Name:
Receptor tyrosine-protein kinase erbB-2
Synonyms:
2.7.10.1 CD_antigen=CD340 ERBB2_HUMAN FASN/HER2 HER2 MLN19 NEU Proto-oncogene Neu Tyrosine kinase-type cell surface receptor HER2 | p185erbB2
Type:
Mol. Mass.:
137894.47
Organism:
Homo sapiens (Human)
Description:
P04626
Residue:
1255
  
Inhibitor
Name:
BDBM50190803
Synonyms:
CHEMBL3982289
Type:
Small organic molecule
Emp. Form.:
C23H21Cl2N5O5
Mol. Mass.:
518.349
SMILES:
ClCC(=O)OCCn1c2cc3c(Nc4ccc(N5CCOCC5)c(Cl)c4)ncnc3cc2oc1=O
: