Target
Epidermal growth factor receptor
Ligand
BDBM50190803
Substrate
Meas. Tech.
ChEBML_1612509
IC50
19±n/a nM
Citation
 Yin, STang, CWang, BZhang, YZhou, LXue, LZhang, C Design, synthesis and biological evaluation of novel EGFR/HER2 dual inhibitors bearing a oxazolo[4,5-g]quinazolin-2(1H)-one scaffold. Eur J Med Chem 120:26-36 (2016)  
Target
Name:
Epidermal growth factor receptor
Synonyms:
EGF Receptor Substrate EGFR_HUMAN ERBB1 Epidermal Growth Factor Receptor erbB-1 Epidermal growth factor receptor (EGFR) HER1 Proto-oncogene c-ErbB-1 Tyrosine-Protein Kinase ErbB-1
Type:
Receptor Kinase Domain
Mol. Mass.:
134279.59
Organism:
Homo sapiens (Human)
Description:
P00533
Residue:
1210
  
Inhibitor
Name:
BDBM50190803
Synonyms:
CHEMBL3982289
Type:
Small organic molecule
Emp. Form.:
C23H21Cl2N5O5
Mol. Mass.:
518.349
SMILES:
ClCC(=O)OCCn1c2cc3c(Nc4ccc(N5CCOCC5)c(Cl)c4)ncnc3cc2oc1=O
: