Target
Receptor tyrosine-protein kinase erbB-2
Ligand
BDBM50190806
Substrate
Meas. Tech.
ChEMBL_1612510 (CHEMBL3854310)
IC50
180±n/a nM
Citation
 Yin, STang, CWang, BZhang, YZhou, LXue, LZhang, C Design, synthesis and biological evaluation of novel EGFR/HER2 dual inhibitors bearing a oxazolo[4,5-g]quinazolin-2(1H)-one scaffold. Eur J Med Chem 120:26-36 (2016)  
Target
Name:
Receptor tyrosine-protein kinase erbB-2
Synonyms:
2.7.10.1 CD_antigen=CD340 ERBB2_HUMAN FASN/HER2 HER2 MLN19 NEU Proto-oncogene Neu Tyrosine kinase-type cell surface receptor HER2 | p185erbB2
Type:
Mol. Mass.:
137894.47
Organism:
Homo sapiens (Human)
Description:
P04626
Residue:
1255
  
Inhibitor
Name:
BDBM50190806
Synonyms:
CHEMBL3936642
Type:
Small organic molecule
Emp. Form.:
C26H19BrClFN4O5
Mol. Mass.:
601.808
SMILES:
Fc1cccc(COc2ccc(Nc3ncnc4cc5oc(=O)n(CCOC(=O)CBr)c5cc34)cc2Cl)c1
: