Target
Receptor tyrosine-protein kinase erbB-2
Ligand
BDBM50190800
Substrate
Meas. Tech.
ChEMBL_1612510 (CHEMBL3854310)
IC50
77±n/a nM
Citation
 Yin, STang, CWang, BZhang, YZhou, LXue, LZhang, C Design, synthesis and biological evaluation of novel EGFR/HER2 dual inhibitors bearing a oxazolo[4,5-g]quinazolin-2(1H)-one scaffold. Eur J Med Chem 120:26-36 (2016)  
Target
Name:
Receptor tyrosine-protein kinase erbB-2
Synonyms:
2.7.10.1 CD_antigen=CD340 ERBB2_HUMAN FASN/HER2 HER2 MLN19 NEU Proto-oncogene Neu Tyrosine kinase-type cell surface receptor HER2 | p185erbB2
Type:
Mol. Mass.:
137894.47
Organism:
Homo sapiens (Human)
Description:
P04626
Residue:
1255
  
Inhibitor
Name:
BDBM50190800
Synonyms:
CHEMBL3912361
Type:
Small organic molecule
Emp. Form.:
C24H23Cl2N5O4
Mol. Mass.:
516.377
SMILES:
ClCC(=O)OCCn1c2cc3c(Nc4ccc(N5CCCCC5)c(Cl)c4)ncnc3cc2oc1=O
: