Target
Epidermal growth factor receptor
Ligand
BDBM50190807
Substrate
Meas. Tech.
ChEMBL_1612509 (CHEMBL3854309)
IC50
6400±n/a nM
Citation
 Yin, STang, CWang, BZhang, YZhou, LXue, LZhang, C Design, synthesis and biological evaluation of novel EGFR/HER2 dual inhibitors bearing a oxazolo[4,5-g]quinazolin-2(1H)-one scaffold. Eur J Med Chem 120:26-36 (2016)  
Target
Name:
Epidermal growth factor receptor
Synonyms:
EGF Receptor Substrate EGFR_HUMAN ERBB1 Epidermal Growth Factor Receptor erbB-1 Epidermal growth factor receptor (EGFR) HER1 Proto-oncogene c-ErbB-1 Tyrosine-Protein Kinase ErbB-1
Type:
Receptor Kinase Domain
Mol. Mass.:
134279.59
Organism:
Homo sapiens (Human)
Description:
P00533
Residue:
1210
  
Inhibitor
Name:
BDBM50190807
Synonyms:
CHEMBL3915306
Type:
Small organic molecule
Emp. Form.:
C26H20BrClN4O5
Mol. Mass.:
583.818
SMILES:
Clc1ccc(COc2ccc(Nc3ncnc4cc5oc(=O)n(CCOC(=O)CBr)c5cc34)cc2)cc1
: