Target
WD repeat-containing protein 48
Ligand
BDBM50191343
Substrate
Meas. Tech.
ChEMBL_1612851 (CHEMBL3854651)
IC50
880±n/a nM
Citation
 Korzhnev, DMHadden, MK Targeting the Translesion Synthesis Pathway for the Development of Anti-Cancer Chemotherapeutics. J Med Chem 59:9321-9336 (2016)  
Target
Name:
WD repeat-containing protein 48
Synonyms:
KIAA1449 USP1-associated factor 1 WD repeat endosomal protein WDR48 p80
Type:
PROTEIN
Mol. Mass.:
76215.66
Organism:
Homo sapiens (Human)
Description:
ChEMBL_109642
Residue:
677
  
Inhibitor
Name:
BDBM50191343
Synonyms:
CHEMBL3967184
Type:
Small organic molecule
Emp. Form.:
C17H10FNO3
Mol. Mass.:
295.2646
SMILES:
Fc1ccc(cc1)C1=NC2C(O1)C(=O)c1ccccc1C2=O
: