Target
Receptor tyrosine-protein kinase erbB-4
Ligand
BDBM50191495
Substrate
Meas. Tech.
ChEMBL_1613065 (CHEMBL3854865)
IC50
2.0±n/a nM
Citation
 Smaill, JBGonzales, AJSpicer, JALee, HReed, JESexton, KAlthaus, IWZhu, TBlack, SLBlaser, ADenny, WAEllis, PAFakhoury, SHarvey, PJHook, KMcCarthy, FOPalmer, BDRivault, FSchlosser, KEllis, TThompson, AMTrachet, EWinters, RTTecle, HBridges, A Tyrosine Kinase Inhibitors. 20. Optimization of Substituted Quinazoline and Pyrido[3,4-d]pyrimidine Derivatives as Orally Active, Irreversible Inhibitors of the Epidermal Growth Factor Receptor Family. J Med Chem 59:8103-24 (2016)  
Target
Name:
Receptor tyrosine-protein kinase erbB-4
Synonyms:
ERBB4 Epidermal growth factor receptor ErbB-4 (HER4) Tyrosine Kinase Proto-oncogene c-ErbB-4 Receptor protein-tyrosine kinase erbB-4 Tyrosine kinase-type cell surface receptor HER4 (HER4)
Type:
Protein
Mol. Mass.:
146803.56
Organism:
Homo sapiens (Human)
Description:
Q15303
Residue:
1308
  
Inhibitor
Name:
BDBM50191495
Synonyms:
CHEMBL3896779
Type:
Small organic molecule
Emp. Form.:
C27H26N6O2
Mol. Mass.:
466.5343
SMILES:
O=C(Nc1cc2c(Nc3ccc(Oc4ccccc4)cc3)ncnc2cn1)\C=C\CN1CCCC1
: