Target
Nischarin
Ligand
BDBM50000214
Substrate
Meas. Tech.
ChEMBL_1614150 (CHEMBL3855950)
Ki
1.4±n/a nM
Citation
 Giusepponi, MECifani, CMicioni Di Bonaventura, MVMattioli, LHudson, ADiamanti, EDel Bello, FGiannella, MMammoli, VPaoletti, CDPiergentili, APigini, MQuaglia, W Combined Interactions with I ACS Med Chem Lett 7:956-961 (2016)  
Target
Name:
Nischarin
Synonyms:
Imidazoline I1 Nisch | Nischarin
Type:
Enzyme Catalytic Domain
Mol. Mass.:
166460.59
Organism:
RAT
Description:
Q4G017
Residue:
1502
  
Inhibitor
Name:
BDBM50000214
Synonyms:
CHEMBL337862
Type:
Small organic molecule
Emp. Form.:
C16H17N3
Mol. Mass.:
251.3263
SMILES:
C(Nc1ccccc1-c1ccccc1)C1=NCCN1
: