Target
Nischarin
Ligand
BDBM50027031
Substrate
Meas. Tech.
ChEMBL_1614150 (CHEMBL3855950)
Ki
7.6±n/a nM
Citation
 Giusepponi, MECifani, CMicioni Di Bonaventura, MVMattioli, LHudson, ADiamanti, EDel Bello, FGiannella, MMammoli, VPaoletti, CDPiergentili, APigini, MQuaglia, W Combined Interactions with I ACS Med Chem Lett 7:956-961 (2016)  
Target
Name:
Nischarin
Synonyms:
Imidazoline I1 Nisch | Nischarin
Type:
Enzyme Catalytic Domain
Mol. Mass.:
166460.59
Organism:
RAT
Description:
Q4G017
Residue:
1502
  
Inhibitor
Name:
BDBM50027031
Synonyms:
(2-Chloro-phenyl)-(4,5-dihydro-1H-imidazol-2-ylmethyl)-amine | CHEMBL51358
Type:
Small organic molecule
Emp. Form.:
C10H12ClN3
Mol. Mass.:
209.675
SMILES:
Clc1ccccc1NCC1=NCCN1
: