Target
Alpha-2B adrenergic receptor
Ligand
BDBM50193035
Substrate
Meas. Tech.
ChEMBL_1614153 (CHEMBL3855953)
EC50
2512±n/a nM
Citation
 Giusepponi, MECifani, CMicioni Di Bonaventura, MVMattioli, LHudson, ADiamanti, EDel Bello, FGiannella, MMammoli, VPaoletti, CDPiergentili, APigini, MQuaglia, W Combined Interactions with I ACS Med Chem Lett 7:956-961 (2016)  
Target
Name:
Alpha-2B adrenergic receptor
Synonyms:
ADA2B_HUMAN ADRA2L1 Adrenergic alpha2B Adrenergic receptor alpha Alpha-2 adrenergic receptor subtype C2 Alpha-2B adrenoreceptor | Alpha-2BAR
Type:
Enzyme
Mol. Mass.:
49964.20
Organism:
Homo sapiens (Human)
Description:
P18089
Residue:
450
  
Inhibitor
Name:
BDBM50193035
Synonyms:
CHEMBL3961335
Type:
Small organic molecule
Emp. Form.:
C13H17N3
Mol. Mass.:
215.2942
SMILES:
C=CCc1ccccc1NCC1=NCCN1
: