Target
Alpha-2C adrenergic receptor
Ligand
BDBM50193035
Substrate
Meas. Tech.
ChEMBL_1614154 (CHEMBL3855954)
EC50
158±n/a nM
Citation
 Giusepponi, MECifani, CMicioni Di Bonaventura, MVMattioli, LHudson, ADiamanti, EDel Bello, FGiannella, MMammoli, VPaoletti, CDPiergentili, APigini, MQuaglia, W Combined Interactions with I ACS Med Chem Lett 7:956-961 (2016)  
Target
Name:
Alpha-2C adrenergic receptor
Synonyms:
ADA2C_HUMAN ADRA2L2 Adrenergic alpha2C Adrenergic receptor alpha Alpha-2 adrenergic receptor subtype C4 Alpha-2C adrenoreceptor | adrenergic, alpha-2C-, receptor [Homo sapiens]
Type:
Enzyme
Mol. Mass.:
49552.32
Organism:
Homo sapiens (Human)
Description:
P18825
Residue:
462
  
Inhibitor
Name:
BDBM50193035
Synonyms:
CHEMBL3961335
Type:
Small organic molecule
Emp. Form.:
C13H17N3
Mol. Mass.:
215.2942
SMILES:
C=CCc1ccccc1NCC1=NCCN1
: