Target
Nischarin
Ligand
BDBM50193037
Substrate
Meas. Tech.
ChEMBL_1614150 (CHEMBL3855950)
Ki
24±n/a nM
Citation
 Giusepponi, MECifani, CMicioni Di Bonaventura, MVMattioli, LHudson, ADiamanti, EDel Bello, FGiannella, MMammoli, VPaoletti, CDPiergentili, APigini, MQuaglia, W Combined Interactions with I ACS Med Chem Lett 7:956-961 (2016)  
Target
Name:
Nischarin
Synonyms:
Imidazoline I1 Nisch | Nischarin
Type:
Enzyme Catalytic Domain
Mol. Mass.:
166460.59
Organism:
RAT
Description:
Q4G017
Residue:
1502
  
Inhibitor
Name:
BDBM50193037
Synonyms:
CHEMBL3920069
Type:
Small organic molecule
Emp. Form.:
C11H11ClN2
Mol. Mass.:
206.671
SMILES:
Clc1ccccc1\C=C\C1=NCCN1
: