Target
Nischarin
Ligand
BDBM50193034
Substrate
Meas. Tech.
ChEMBL_1614150 (CHEMBL3855950)
Ki
2.0±n/a nM
Citation
 Giusepponi, MECifani, CMicioni Di Bonaventura, MVMattioli, LHudson, ADiamanti, EDel Bello, FGiannella, MMammoli, VPaoletti, CDPiergentili, APigini, MQuaglia, W Combined Interactions with I ACS Med Chem Lett 7:956-961 (2016)  
Target
Name:
Nischarin
Synonyms:
Imidazoline I1 Nisch | Nischarin
Type:
Enzyme Catalytic Domain
Mol. Mass.:
166460.59
Organism:
RAT
Description:
Q4G017
Residue:
1502
  
Inhibitor
Name:
BDBM50193034
Synonyms:
CHEMBL3904276
Type:
Small organic molecule
Emp. Form.:
C11H15N3
Mol. Mass.:
189.2569
SMILES:
Cc1ccccc1NCC1=NCCN1
: