Target
Nischarin
Ligand
BDBM50193036
Substrate
Meas. Tech.
ChEMBL_1614150 (CHEMBL3855950)
Ki
8.3±n/a nM
Citation
 Giusepponi, MECifani, CMicioni Di Bonaventura, MVMattioli, LHudson, ADiamanti, EDel Bello, FGiannella, MMammoli, VPaoletti, CDPiergentili, APigini, MQuaglia, W Combined Interactions with I ACS Med Chem Lett 7:956-961 (2016)  
Target
Name:
Nischarin
Synonyms:
Imidazoline I1 Nisch | Nischarin
Type:
Enzyme Catalytic Domain
Mol. Mass.:
166460.59
Organism:
RAT
Description:
Q4G017
Residue:
1502
  
Inhibitor
Name:
BDBM50193036
Synonyms:
CHEMBL3892351
Type:
Small organic molecule
Emp. Form.:
C13H19N3
Mol. Mass.:
217.3101
SMILES:
CCCc1ccccc1NCC1=NCCN1
: