Target
Nischarin
Ligand
BDBM50138500
Substrate
Meas. Tech.
ChEMBL_1614180 (CHEMBL3855980)
Ki
19±n/a nM
Citation
 Giusepponi, MECifani, CMicioni Di Bonaventura, MVMattioli, LHudson, ADiamanti, EDel Bello, FGiannella, MMammoli, VPaoletti, CDPiergentili, APigini, MQuaglia, W Combined Interactions with I ACS Med Chem Lett 7:956-961 (2016)  
Target
Name:
Nischarin
Synonyms:
Imidazoline I1 Nisch | Nischarin
Type:
Enzyme Catalytic Domain
Mol. Mass.:
166460.59
Organism:
RAT
Description:
Q4G017
Residue:
1502
  
Inhibitor
Name:
BDBM50138500
Synonyms:
2-((E)-Styryl)-4,5-dihydro-1H-imidazole CHEMBL275970
Type:
Small organic molecule
Emp. Form.:
C11H12N2
Mol. Mass.:
172.2264
SMILES:
C1CN=C(N1)\C=C\c1ccccc1
: