Target
Nischarin
Ligand
BDBM50193041
Substrate
Meas. Tech.
ChEMBL_1614150 (CHEMBL3855950)
Ki
69±n/a nM
Citation
 Giusepponi, MECifani, CMicioni Di Bonaventura, MVMattioli, LHudson, ADiamanti, EDel Bello, FGiannella, MMammoli, VPaoletti, CDPiergentili, APigini, MQuaglia, W Combined Interactions with I ACS Med Chem Lett 7:956-961 (2016)  
Target
Name:
Nischarin
Synonyms:
Imidazoline I1 Nisch | Nischarin
Type:
Enzyme Catalytic Domain
Mol. Mass.:
166460.59
Organism:
RAT
Description:
Q4G017
Residue:
1502
  
Inhibitor
Name:
BDBM50193041
Synonyms:
CHEMBL3939078
Type:
Small organic molecule
Emp. Form.:
C14H16N2
Mol. Mass.:
212.2902
SMILES:
C=CCc1ccccc1\C=C\C1=NCCN1
: