Target
Transient receptor potential cation channel subfamily V member 1
Ligand
BDBM50131046
Substrate
Meas. Tech.
ChEMBL_1614338 (CHEMBL3856407)
EC50
2060±n/a nM
Citation
 Wang, SYamamoto, SKogure, YZhang, WNoguchi, KDai, Y Partial Activation and Inhibition of TRPV1 Channels by Evodiamine and Rutaecarpine, Two Major Components of the Fruits of Evodia rutaecarpa. J Nat Prod 79:1225-30 (2016)  
Target
Name:
Transient receptor potential cation channel subfamily V member 1
Synonyms:
Capsaicin receptor TRPV1_RAT Trpv1 Vanilloid VR1 Vanilloid receptor 1 (VRI/TRPV1) Vanilloid receptor type 1-like (TrpV1/Vr1) Vr1l | osm-9-like TRP channel 1
Type:
Transient Receptor
Mol. Mass.:
94956.12
Organism:
Rattus norvegicus (rat)
Description:
O35433
Residue:
838
  
Inhibitor
Name:
BDBM50131046
Synonyms:
8,13-Dihydro-7H-indolo[2',3':3,4]pyrido[2,1-b]quinazolin-5-one cid_65752 | rutaecarpine
Type:
Small organic molecule
Emp. Form.:
C18H13N3O
Mol. Mass.:
287.3153
SMILES:
O=c1n2CCc3c([nH]c4ccccc34)-c2nc2ccccc12
: