Target
Transient receptor potential cation channel subfamily V member 1
Ligand
BDBM50016250
Substrate
Meas. Tech.
ChEMBL_1614374 (CHEMBL3856443)
IC50
440±n/a nM
Citation
 Wang, SYamamoto, SKogure, YZhang, WNoguchi, KDai, Y Partial Activation and Inhibition of TRPV1 Channels by Evodiamine and Rutaecarpine, Two Major Components of the Fruits of Evodia rutaecarpa. J Nat Prod 79:1225-30 (2016)  
Target
Name:
Transient receptor potential cation channel subfamily V member 1
Synonyms:
Capsaicin receptor TRPV1_RAT Trpv1 Vanilloid VR1 Vanilloid receptor 1 (VRI/TRPV1) Vanilloid receptor type 1-like (TrpV1/Vr1) Vr1l | osm-9-like TRP channel 1
Type:
Transient Receptor
Mol. Mass.:
94956.12
Organism:
Rattus norvegicus (rat)
Description:
O35433
Residue:
838
  
Inhibitor
Name:
BDBM50016250
Synonyms:
CHEMBL81925
Type:
Small organic molecule
Emp. Form.:
C19H17N3O
Mol. Mass.:
303.3578
SMILES:
CN1C2N(CCc3c2[nH]c2ccccc32)C(=O)c2ccccc12
: