Target
BDNF/NT-3 growth factors receptor
Ligand
BDBM50193395
Substrate
Meas. Tech.
ChEMBL_1615858 (CHEMBL3857927)
IC50
4.6±n/a nM
Citation
 Talele, TT The"Cyclopropyl Fragment" is a Versatile Player that Frequently Appears in Preclinical/Clinical Drug Molecules. J Med Chem 59:8712-8756 (2016)  
Target
Name:
BDNF/NT-3 growth factors receptor
Synonyms:
GP145-TrkB NTRK2 Neurotrophic tyrosine kinase receptor type 2 Trk-B Tropomyosin-related kinase B Tyrosine kinase receptor B (Trk-B)
Type:
Enzyme
Mol. Mass.:
91996.87
Organism:
Homo sapiens (Human)
Description:
Q16620
Residue:
822
  
Inhibitor
Name:
BDBM50193395
Synonyms:
Altiratinib DP-5164
Type:
Small organic molecule
Emp. Form.:
C26H21F3N4O4
Mol. Mass.:
510.4645
SMILES:
Fc1ccc(NC(=O)C2(CC2)C(=O)Nc2cc(F)c(Oc3ccnc(NC(=O)C4CC4)c3)cc2F)cc1
: