Target
Mast/stem cell growth factor receptor Kit
Ligand
BDBM50399540
Substrate
Meas. Tech.
ChEMBL_1615853 (CHEMBL3857922)
IC50
6.7±n/a nM
Citation
 Talele, TT The"Cyclopropyl Fragment" is a Versatile Player that Frequently Appears in Preclinical/Clinical Drug Molecules. J Med Chem 59:8712-8756 (2016)  
Target
Name:
Mast/stem cell growth factor receptor Kit
Synonyms:
CD117 antigen KIT Mast/stem cell growth factor receptor Kit (cKIT) Proto-oncogene tyrosine-protein kinase Kit Stem cell growth factor receptor Tyrosine-protein kinase Kit c-kit v-kit Hardy-Zuckerman 4 feline sarcoma viral oncogene homolog
Type:
Protein
Mol. Mass.:
109869.37
Organism:
Homo sapiens (Human)
Description:
P10721
Residue:
976
  
Inhibitor
Name:
BDBM50399540
Synonyms:
FORETINIB US10882853, Compound For-Oxide
Type:
Small organic molecule
Emp. Form.:
C34H34F2N4O6
Mol. Mass.:
632.6538
SMILES:
COc1cc2c(Oc3ccc(NC(=O)C4(CC4)C(=O)Nc4ccc(F)cc4)cc3F)ccnc2cc1OCCCN1CCOCC1
: