Target
Angiopoietin-1 receptor
Ligand
BDBM50021574
Substrate
Meas. Tech.
ChEMBL_1615846 (CHEMBL3857915)
IC50
14±n/a nM
Citation
 Talele, TT The"Cyclopropyl Fragment" is a Versatile Player that Frequently Appears in Preclinical/Clinical Drug Molecules. J Med Chem 59:8712-8756 (2016)  
Target
Name:
Angiopoietin-1 receptor
Synonyms:
TEK TIE2_HUMAN Tyrosine-protein kinase receptor (TIE-2) Tyrosine-protein kinase receptor TEK (p140 TEK) Tyrosine-protein kinase receptor TIE2/TEK VMCM1 p140 TEK
Type:
Enzyme
Mol. Mass.:
125835.70
Organism:
Homo sapiens (Human)
Description:
Q02763
Residue:
1124
  
Inhibitor
Name:
BDBM50021574
Synonyms:
BMS-907351 CHEBI:72317 Cometriq US10202365, Compound Cabozantinib US10273211, Compound Cabozantinib US10774070, Compound Cabozantinib XL-184 | cabozantinib s-malate
Type:
Small organic molecule
Emp. Form.:
C28H24FN3O5
Mol. Mass.:
501.5057
SMILES:
COc1cc2nccc(Oc3ccc(NC(=O)C4(CC4)C(=O)Nc4ccc(F)cc4)cc3)c2cc1OC
: