Target
Delta-type opioid receptor
Ligand
BDBM50045776
Substrate
Meas. Tech.
ChEMBL_1615868 (CHEMBL3857937)
Ki
16±n/a nM
Citation
 Talele, TT The"Cyclopropyl Fragment" is a Versatile Player that Frequently Appears in Preclinical/Clinical Drug Molecules. J Med Chem 59:8712-8756 (2016)  
Target
Name:
Delta-type opioid receptor
Synonyms:
D-OR-1 Delta opioid receptor OPIATE Delta OPRD1 OPRK1 | opioid receptor, delta 1
Type:
G Protein-Coupled Receptor (GPCR)
Mol. Mass.:
40382.98
Organism:
Homo sapiens (Human)
Description:
Competition binding assays were carried out using membrane preparations from transfected HN9.10 cells that constitutively expressed the delta opioid receptor.
Residue:
372
  
Inhibitor
Name:
BDBM50045776
Synonyms:
CHEMBL982 NALMEFENE ORF-11676 cid_5284594
Type:
Small organic molecule
Emp. Form.:
C21H25NO3
Mol. Mass.:
339.4281
SMILES:
Oc1ccc2C[C@H]3N(CC4CC4)CC[C@@]45[C@@H](Oc1c24)C(=C)CC[C@@]35O
: