Target
E3 SUMO-protein ligase CBX4
Ligand
BDBM50194260
Substrate
Meas. Tech.
ChEMBL_1616630 (CHEMBL3858699)
IC50
480±n/a nM
Citation
 Stuckey, JISimpson, CNorris-Drouin, JLCholensky, SHLee, JPasca, RCheng, NDickson, BMPearce, KHFrye, SVJames, LI Structure-Activity Relationships and Kinetic Studies of Peptidic Antagonists of CBX Chromodomains. J Med Chem 59:8913-8923 (2016)  
Target
Name:
E3 SUMO-protein ligase CBX4
Synonyms:
6.3.2.- CBX4_HUMAN Pc2 hPc2
Type:
PROTEIN
Mol. Mass.:
61401.05
Organism:
Homo sapiens (Human)
Description:
ChEMBL_108273
Residue:
560
  
Inhibitor
Name:
BDBM50194260
Synonyms:
CHEMBL3973366
Type:
Small organic molecule
Emp. Form.:
C40H57F3N6O8
Mol. Mass.:
806.9112
SMILES:
CCN(CC)CCCC[C@H](NC(=O)[C@H](CC(C)C)NC(=O)[C@H](C)NC(=O)[C@H](Cc1ccccc1)NC(=O)c1ccc(cc1)C(F)(F)F)C(=O)N[C@@H](CO)C(=O)OC
: