Target
E3 SUMO-protein ligase CBX4
Ligand
BDBM50194262
Substrate
Meas. Tech.
ChEMBL_1616630 (CHEMBL3858699)
IC50
3400±n/a nM
Citation
 Stuckey, JISimpson, CNorris-Drouin, JLCholensky, SHLee, JPasca, RCheng, NDickson, BMPearce, KHFrye, SVJames, LI Structure-Activity Relationships and Kinetic Studies of Peptidic Antagonists of CBX Chromodomains. J Med Chem 59:8913-8923 (2016)  
Target
Name:
E3 SUMO-protein ligase CBX4
Synonyms:
6.3.2.- CBX4_HUMAN Pc2 hPc2
Type:
PROTEIN
Mol. Mass.:
61401.05
Organism:
Homo sapiens (Human)
Description:
ChEMBL_108273
Residue:
560
  
Inhibitor
Name:
BDBM50194262
Synonyms:
CHEMBL3949885
Type:
Small organic molecule
Emp. Form.:
C42H61N7O8
Mol. Mass.:
791.9758
SMILES:
CCN(CC)CCCC[C@H](NC(=O)[C@H](CC(C)C)NC(=O)[C@H](C)NC(=O)[C@H](Cc1ccccc1)NC(=O)Cc1c[nH]c2ccccc12)C(=O)N[C@@H](CO)C(=O)OC
: