Target
E3 SUMO-protein ligase CBX4
Ligand
BDBM50194467
Substrate
Meas. Tech.
ChEMBL_1616630 (CHEMBL3858699)
IC50
>60000±n/a nM
Citation
 Stuckey, JISimpson, CNorris-Drouin, JLCholensky, SHLee, JPasca, RCheng, NDickson, BMPearce, KHFrye, SVJames, LI Structure-Activity Relationships and Kinetic Studies of Peptidic Antagonists of CBX Chromodomains. J Med Chem 59:8913-8923 (2016)  
Target
Name:
E3 SUMO-protein ligase CBX4
Synonyms:
6.3.2.- CBX4_HUMAN Pc2 hPc2
Type:
PROTEIN
Mol. Mass.:
61401.05
Organism:
Homo sapiens (Human)
Description:
ChEMBL_108273
Residue:
560
  
Inhibitor
Name:
BDBM50194467
Synonyms:
CHEMBL3918626
Type:
Small organic molecule
Emp. Form.:
C41H60N8O9
Mol. Mass.:
808.9633
SMILES:
COC(=O)[C@H](CO)NC(=O)[C@H](CCCCN(C)C1CNC1)NC(=O)[C@H](CC(C)C)NC(=O)[C@H](C)NC(=O)[C@H](Cc1ccccc1)NC(=O)CNC(=O)c1ccccc1
: