Target
Metabotropic glutamate receptor 2
Ligand
BDBM50194614
Substrate
Meas. Tech.
ChEMBL_1616775 (CHEMBL3858844)
EC50
2.6±n/a nM
Citation
 Cid, JMTresadern, GVega, JAde Lucas, AIDel Cerro, AMatesanz, ELinares, MLGarcía, AIturrino, LPérez-Benito, LMacdonald, GJOehlrich, DLavreysen, HPeeters, LCeusters, MAhnaou, ADrinkenburg, WMackie, CSomers, MTrabanco, AA Discovery of 8-Trifluoromethyl-3-cyclopropylmethyl-7-[(4-(2,4-difluorophenyl)-1-piperazinyl)methyl]-1,2,4-triazolo[4,3-a]pyridine (JNJ-46356479), a Selective and Orally Bioavailable mGlu2 Receptor Positive Allosteric Modulator (PAM). J Med Chem 59:8495-507 (2016)  
Target
Name:
Metabotropic glutamate receptor 2
Synonyms:
GPRC1B GRM2_HUMAN Metabotropic glutamate receptor mGlu2 | metabotropic glutamate 2
Type:
Enzyme
Mol. Mass.:
95584.88
Organism:
Homo sapiens (Human)
Description:
Q14416
Residue:
872
  
Inhibitor
Name:
BDBM50194614
Synonyms:
CHEMBL3901998
Type:
Small organic molecule
Emp. Form.:
C24H27F3N4
Mol. Mass.:
428.4932
SMILES:
CC1(CCCN(Cc2ccn3c(CC4CC4)nnc3c2C(F)(F)F)C1)c1ccccc1
: