Target
Alpha-1A adrenergic receptor
Ligand
BDBM50195284
Substrate
Meas. Tech.
ChEMBL_1617618 (CHEMBL3859687)
IC50
8669±n/a nM
Citation
 Guo, DLi, JLin, HZhou, YChen, YZhao, FSun, HZhang, DLi, HShoichet, BKShan, LZhang, WXie, XJiang, HLiu, H Design, Synthesis, and Biological Evaluation of Novel Tetrahydroprotoberberine Derivatives (THPBs) as Selectivea J Med Chem 59:9489-9502 (2016)  
Target
Name:
Alpha-1A adrenergic receptor
Synonyms:
ADA1A_HUMAN ADRA1C Alpha 1A-adrenoceptor Alpha adrenergic receptor 1a Alpha-adrenergic receptor 1c adrenergic Alpha1 | adrenergic Alpha1C
Type:
Cell-surface receptors
Mol. Mass.:
51511.67
Organism:
Homo sapiens (Human)
Description:
P35348
Residue:
466
  
Inhibitor
Name:
BDBM50195284
Synonyms:
CHEMBL3904395
Type:
Small organic molecule
Emp. Form.:
C21H22N2O
Mol. Mass.:
318.4122
SMILES:
COc1ccc2C3Cc4c([nH]c5ccccc45)C(C)N3CCc2c1
: