Target
Beta-lactamase
Ligand
BDBM50355012
Substrate
Meas. Tech.
ChEMBL_1617950 (CHEMBL3860119)
IC50
480000±n/a nM
Citation
 Lund, BAChristopeit, TGuttormsen, YBayer, ALeiros, HK Screening and Design of Inhibitor Scaffolds for the Antibiotic Resistance Oxacillinase-48 (OXA-48) through Surface Plasmon Resonance Screening. J Med Chem 59:5542-54 (2016)  
Target
Name:
Beta-lactamase
Synonyms:
Beta-lactamase Synonyms=blaOXA-48 | bla
Type:
PROTEIN
Mol. Mass.:
30363.94
Organism:
Klebsiella pneumoniae
Description:
ChEMBL_103606
Residue:
265
  
Inhibitor
Name:
BDBM50355012
Synonyms:
CHEMBL1834963
Type:
Small organic molecule
Emp. Form.:
C15H10O2
Mol. Mass.:
222.2387
SMILES:
OC(=O)c1cccc(c1)C#Cc1ccccc1
: