Target
Glycogen phosphorylase, muscle form
Ligand
BDBM50263771
Substrate
Meas. Tech.
ChEMBL_1619028 (CHEMBL3861197)
Ki
4600±n/a nM
Citation
 Galal, SAKhattab, MAndreadaki, FChrysina, EDPraly, JPRagab, FAFEl Diwani, HI Synthesis of (benzimidazol-2-yl)aniline derivatives as glycogen phosphorylase inhibitors. Bioorg Med Chem 24:5423-5430 (2016)  
Target
Name:
Glycogen phosphorylase, muscle form
Synonyms:
Glycogen Phosphorylase (PYGM) Glycogen phosphorylase, muscle form PYGM | PYGM_RABIT
Type:
Enzyme
Mol. Mass.:
97296.32
Organism:
Oryctolagus cuniculus (rabbit)
Description:
Phosphorylation of Ser-15 converts phosphorylase B (unphosphorylated) to phosphorylase A.
Residue:
843
  
Inhibitor
Name:
BDBM50263771
Synonyms:
1-benzoyl-3-((2R,3R,4S,5S,6R)-3,4,5-trihydroxy-6-(hydroxymethyl)-tetrahydro-2H-pyran-2-yl)urea N-((2R,3R,4S,5S,6R)-3,4,5-trihydroxy-6-(hydroxymethyl)tetrahydro-2H-pyran-2-ylcarbamoyl)benzamide | N-BENZOYL-N'-BETA-D-GLUCOPYRANOSYL UREA
Type:
Small organic molecule
Emp. Form.:
C14H18N2O7
Mol. Mass.:
326.3019
SMILES:
OC[C@H]1O[C@@H](NC(=O)NC(=O)c2ccccc2)[C@H](O)[C@@H](O)[C@@H]1O
: