Target
Fatty acid-binding protein 5
Ligand
BDBM50197090
Substrate
Meas. Tech.
ChEMBL_1619187 (CHEMBL3861356)
Ki
133±n/a nM
Citation
 Kühne, HObst-Sander, UKuhn, BConte, ACeccarelli, SMNeidhart, WRudolph, MGOttaviani, GGasser, RSo, SSLi, SZhang, XGao, LMyers, M Design and synthesis of selective, dual fatty acid binding protein 4 and 5 inhibitors. Bioorg Med Chem Lett 26:5092-5097 (2016)  
Target
Name:
Fatty acid-binding protein 5
Synonyms:
FABP5 Fatty acid binding protein epidermal | Fatty acid-binding protein 5 (FABP5)
Type:
Enzyme
Mol. Mass.:
15164.79
Organism:
Homo sapiens (Human)
Description:
Q01469
Residue:
135
  
Inhibitor
Name:
BDBM50197090
Synonyms:
CHEMBL3970105
Type:
Small organic molecule
Emp. Form.:
C22H19ClN4OS
Mol. Mass.:
422.93
SMILES:
Clc1ccc2nc(N3CCCCC3)c(-c3n[nH]c(=S)o3)c(-c3ccccc3)c2c1
: