Target
Cytochrome P450 3A4
Ligand
BDBM50197094
Substrate
Meas. Tech.
ChEMBL_1619192 (CHEMBL3861361)
IC50
>50000±n/a nM
Citation
 Kühne, HObst-Sander, UKuhn, BConte, ACeccarelli, SMNeidhart, WRudolph, MGOttaviani, GGasser, RSo, SSLi, SZhang, XGao, LMyers, M Design and synthesis of selective, dual fatty acid binding protein 4 and 5 inhibitors. Bioorg Med Chem Lett 26:5092-5097 (2016)  
Target
Name:
Cytochrome P450 3A4
Synonyms:
Albendazole monooxygenase CP3A4_HUMAN CYP3A4 CYPIIIA4 Cytochrome P450 3A4 (CYP3A4) Nifedipine oxidase Taurochenodeoxycholate 6-alpha-hydroxylase
Type:
Enzyme
Mol. Mass.:
57349.57
Organism:
Homo sapiens (Human)
Description:
Residue:
503
  
Inhibitor
Name:
BDBM50197094
Synonyms:
CHEMBL3941588
Type:
Small organic molecule
Emp. Form.:
C21H19ClN2O2
Mol. Mass.:
366.841
SMILES:
OC(=O)c1c(nc2ccc(Cl)cc2c1-c1ccccc1)N1CCCCC1
: