Target
Fatty acid-binding protein 5
Ligand
BDBM50197086
Substrate
Meas. Tech.
ChEMBL_1619187 (CHEMBL3861356)
Ki
120±n/a nM
Citation
 Kühne, HObst-Sander, UKuhn, BConte, ACeccarelli, SMNeidhart, WRudolph, MGOttaviani, GGasser, RSo, SSLi, SZhang, XGao, LMyers, M Design and synthesis of selective, dual fatty acid binding protein 4 and 5 inhibitors. Bioorg Med Chem Lett 26:5092-5097 (2016)  
Target
Name:
Fatty acid-binding protein 5
Synonyms:
FABP5 Fatty acid binding protein epidermal | Fatty acid-binding protein 5 (FABP5)
Type:
Enzyme
Mol. Mass.:
15164.79
Organism:
Homo sapiens (Human)
Description:
Q01469
Residue:
135
  
Inhibitor
Name:
BDBM50197086
Synonyms:
CHEMBL3971182
Type:
Small organic molecule
Emp. Form.:
C21H18Cl2N2O2
Mol. Mass.:
401.286
SMILES:
OC(=O)c1c(nc2c(Cl)cc(Cl)cc2c1-c1ccccc1)N1CCCCC1
: