Target
Yersiniabactin biosynthetic protein
Ligand
BDBM50197294
Substrate
Meas. Tech.
ChEMBL_1619390 (CHEMBL3861559)
Ki
1700±n/a nM
Citation
 Davis, TDMohandas, PChiriac, MIBythrow, GVQuadri, LETan, DS Design, synthesis, and biological evaluation ofa-hydroxyacyl-AMS inhibitors of amino acid adenylation enzymes. Bioorg Med Chem Lett 26:5340-5345 (2016)  
Target
Name:
Yersiniabactin biosynthetic protein
Synonyms:
Yersiniabactin non-ribosomal peptide synthetase HMWP2 | irp2
Type:
PROTEIN
Mol. Mass.:
228633.39
Organism:
Yersinia pestis
Description:
ChEMBL_116974
Residue:
2035
  
Inhibitor
Name:
BDBM50197294
Synonyms:
CHEMBL3897138
Type:
Small organic molecule
Emp. Form.:
C15H21N7O7S
Mol. Mass.:
443.435
SMILES:
N[C@H]1CCCc2nc3c(N)ncnc3n2[C@@H]2O[C@H](COS(=O)(=O)NC1=O)[C@@H](O)[C@H]2O
: