Target
Prostaglandin G/H synthase 1
Ligand
BDBM50135226
Substrate
Meas. Tech.
ChEMBL_1619472 (CHEMBL3861641)
IC50
>1000±n/a nM
Citation
 Park, EBKim, KJJeong, HRLee, JKKim, HJLee, HHLim, JWShin, JSKoeberle, AWerz, OLee, KTLee, JY Synthesis, structure determination, and biological evaluation of phenylsulfonyl hydrazide derivatives as potential anti-inflammatory agents. Bioorg Med Chem Lett 26:5193-5197 (2016)  
Target
Name:
Prostaglandin G/H synthase 1
Synonyms:
COX1 Cyclooxygenase-1 (COX-1) PTGS1 | Prostaglandin G/H synthase (cyclooxygenase)
Type:
Protein
Mol. Mass.:
68868.60
Organism:
Ovis aries (Sheep)
Description:
Residue:
600
  
Inhibitor
Name:
BDBM50135226
Synonyms:
CHEMBL3747473
Type:
Small organic molecule
Emp. Form.:
C27H24N2O6S
Mol. Mass.:
504.554
SMILES:
COc1ccc(cc1)S(=O)(=O)N(Nc1ccccc1)C(=O)Oc1ccc(OCc2ccccc2)cc1
: