Target
Prostaglandin E synthase
Ligand
BDBM50197521
Substrate
Meas. Tech.
ChEMBL_1619471 (CHEMBL3861640)
IC50
550±n/a nM
Citation
 Park, EBKim, KJJeong, HRLee, JKKim, HJLee, HHLim, JWShin, JSKoeberle, AWerz, OLee, KTLee, JY Synthesis, structure determination, and biological evaluation of phenylsulfonyl hydrazide derivatives as potential anti-inflammatory agents. Bioorg Med Chem Lett 26:5193-5197 (2016)  
Target
Name:
Prostaglandin E synthase
Synonyms:
5.3.99.3 PTGES_MOUSE Prostaglandin E synthase mPGES-1
Type:
PROTEIN
Mol. Mass.:
17293.88
Organism:
Mus musculus
Description:
ChEMBL_104562
Residue:
153
  
Inhibitor
Name:
BDBM50197521
Synonyms:
CHEMBL3922351
Type:
Small organic molecule
Emp. Form.:
C22H19ClN2O4S
Mol. Mass.:
442.915
SMILES:
Clc1ccc(cc1)S(=O)(=O)N(Nc1ccccc1)C(=O)Oc1ccc2CCCc2c1
: