Target
Prostaglandin G/H synthase 2
Ligand
BDBM50197521
Substrate
Meas. Tech.
ChEMBL_1619473 (CHEMBL3861642)
IC50
>1000±n/a nM
Citation
 Park, EBKim, KJJeong, HRLee, JKKim, HJLee, HHLim, JWShin, JSKoeberle, AWerz, OLee, KTLee, JY Synthesis, structure determination, and biological evaluation of phenylsulfonyl hydrazide derivatives as potential anti-inflammatory agents. Bioorg Med Chem Lett 26:5193-5197 (2016)  
Target
Name:
Prostaglandin G/H synthase 2
Synonyms:
COX2 Cyclooxygenase 2 (COX-2) Cyclooxygenase-2 (COX-2 AA) Cyclooxygenase-2 (COX-2) PGH2_HUMAN PHS II Prostaglandin E synthase/G/H synthase 2 Prostaglandin-endoperoxide synthase 2
Type:
Enzyme
Mol. Mass.:
69003.89
Organism:
Homo sapiens (Human)
Description:
Recombinant Cox-2 provided by Cayman (Cayman Chemical Co.,Ann Arbor, MI).
Residue:
604
  
Inhibitor
Name:
BDBM50197521
Synonyms:
CHEMBL3922351
Type:
Small organic molecule
Emp. Form.:
C22H19ClN2O4S
Mol. Mass.:
442.915
SMILES:
Clc1ccc(cc1)S(=O)(=O)N(Nc1ccccc1)C(=O)Oc1ccc2CCCc2c1
: