Target
5-hydroxytryptamine receptor 2A
Ligand
BDBM50199126
Substrate
Meas. Tech.
ChEMBL_1621377 (CHEMBL3863660)
Ki
391±n/a nM
Citation
 Ofori, EZhu, XYEtukala, JRBricker, BAAblordeppey, SY Synthesis and evaluation of the structural elements in alkylated tetrahydroisoquinolines for binding to CNS receptors. Bioorg Med Chem 24:5730-5740 (2016)  
Target
Name:
5-hydroxytryptamine receptor 2A
Synonyms:
5-HT-2 5-HT2A 5-hydroxytryptamine receptor 2A (5HT-2A) 5HT2A_HUMAN HTR2A | Serotonin receptor 2A
Type:
undefined
Mol. Mass.:
52607.65
Organism:
Homo sapiens (Human)
Description:
P28223
Residue:
471
  
Inhibitor
Name:
BDBM50199126
Synonyms:
CHEMBL3978642
Type:
Small organic molecule
Emp. Form.:
C20H22ClNO
Mol. Mass.:
327.848
SMILES:
Cl.O=C1C(CCN2CCc3ccccc3C2)Cc2ccccc12
: