Target
D(2) dopamine receptor
Ligand
BDBM50199126
Substrate
Meas. Tech.
ChEMBL_1621374 (CHEMBL3863657)
Ki
2584±n/a nM
Citation
 Ofori, EZhu, XYEtukala, JRBricker, BAAblordeppey, SY Synthesis and evaluation of the structural elements in alkylated tetrahydroisoquinolines for binding to CNS receptors. Bioorg Med Chem 24:5730-5740 (2016)  
Target
Name:
D(2) dopamine receptor
Synonyms:
D(2) dopamine receptor DOPAMINE D2 Long DRD2 Dopamine D2 receptor Dopamine D2 receptor (D2R) Dopamine2-like | d2
Type:
Cell-surface receptors
Mol. Mass.:
50647.10
Organism:
Homo sapiens (Human)
Description:
P14416
Residue:
443
  
Inhibitor
Name:
BDBM50199126
Synonyms:
CHEMBL3978642
Type:
Small organic molecule
Emp. Form.:
C20H22ClNO
Mol. Mass.:
327.848
SMILES:
Cl.O=C1C(CCN2CCc3ccccc3C2)Cc2ccccc12
: