Target
Histamine H1 receptor
Ligand
BDBM50199126
Substrate
Meas. Tech.
ChEMBL_1621381 (CHEMBL3863664)
Ki
25±n/a nM
Citation
 Ofori, EZhu, XYEtukala, JRBricker, BAAblordeppey, SY Synthesis and evaluation of the structural elements in alkylated tetrahydroisoquinolines for binding to CNS receptors. Bioorg Med Chem 24:5730-5740 (2016)  
Target
Name:
Histamine H1 receptor
Synonyms:
H1R HISTAMINE H1 HRH1_HUMAN
Type:
G Protein-Coupled Receptor (GPCR)
Mol. Mass.:
55808.72
Organism:
Homo sapiens (Human)
Description:
Cell pellets from SK-N-MC cells transfected with human H1 receptor were used in binding assay.
Residue:
487
  
Inhibitor
Name:
BDBM50199126
Synonyms:
CHEMBL3978642
Type:
Small organic molecule
Emp. Form.:
C20H22ClNO
Mol. Mass.:
327.848
SMILES:
Cl.O=C1C(CCN2CCc3ccccc3C2)Cc2ccccc12
: