Target
Shiga toxin subunit A
Ligand
BDBM50199478
Substrate
Meas. Tech.
ChEMBL_1621651 (CHEMBL3863934)
Ki
5000±n/a nM
Citation
 Chauhan, VChaudhary, DPathak, USaxena, NDhaked, RK In Silico Discovery and Validation of Amide Based Small Molecule Targeting the Enzymatic Site of Shiga Toxin. J Med Chem 59:10763-10773 (2016)  
Target
Name:
Shiga toxin subunit A
Synonyms:
STXA_SHIDY stxA
Type:
PROTEIN
Mol. Mass.:
34823.39
Organism:
Shigella dysenteriae
Description:
ChEMBL_116947
Residue:
315
  
Inhibitor
Name:
BDBM50199478
Synonyms:
CHEMBL3917910
Type:
Small organic molecule
Emp. Form.:
C15H12N2O4
Mol. Mass.:
284.2668
SMILES:
CC(=O)c1ccccc1NC(=O)c1ccc(cc1)[N+]([O-])=O
: