Target
Cruzipain
Ligand
BDBM50201259
Substrate
Meas. Tech.
ChEMBL_1623049 (CHEMBL3865401)
Ki
0.440000±n/a nM
Citation
 Latorre, ASchirmeister, TKesselring, JJung, SJohé, PHellmich, UAHeilos, AEngels, BKrauth-Siegel, RLDirdjaja, NBou-Iserte, LRodríguez, SGonzález, FV Dipeptidyl Nitroalkenes as Potent Reversible Inhibitors of Cysteine Proteases Rhodesain and Cruzain. ACS Med Chem Lett 7:1073-1076 (2016)  
Target
Name:
Cruzipain
Synonyms:
CYSP_TRYCR Cruzaine | Major cysteine proteinase
Type:
Protein
Mol. Mass.:
49831.41
Organism:
Trypanosoma cruzi
Description:
P25779
Residue:
467
  
Inhibitor
Name:
BDBM50201259
Synonyms:
CHEMBL3907022
Type:
Small organic molecule
Emp. Form.:
C21H23N3O5
Mol. Mass.:
397.4244
SMILES:
C[C@H](NC(=O)[C@H](Cc1ccccc1)NC(=O)OCc1ccccc1)\C=C\[N+]([O-])=O
: