Target
Procathepsin L
Ligand
BDBM50201211
Substrate
Meas. Tech.
ChEMBL_1623051 (CHEMBL3865403)
Ki
27±n/a nM
Citation
 Latorre, ASchirmeister, TKesselring, JJung, SJohé, PHellmich, UAHeilos, AEngels, BKrauth-Siegel, RLDirdjaja, NBou-Iserte, LRodríguez, SGonzález, FV Dipeptidyl Nitroalkenes as Potent Reversible Inhibitors of Cysteine Proteases Rhodesain and Cruzain. ACS Med Chem Lett 7:1073-1076 (2016)  
Target
Name:
Procathepsin L
Synonyms:
CATL1_HUMAN CTSL CTSL1 Cathepsin L Cathepsin L1 heavy chain MEP cathepsin L preproprotein
Type:
Enzyme
Mol. Mass.:
37557.19
Organism:
Homo sapiens (Human)
Description:
Purchased from Calbiochem (San Diego, CA).
Residue:
333
  
Inhibitor
Name:
BDBM50201211
Synonyms:
CHEMBL3930083
Type:
Small organic molecule
Emp. Form.:
C25H31N3O5
Mol. Mass.:
453.5307
SMILES:
CC(C)C[C@H](NC(=O)OCc1ccccc1)C(=O)N[C@@H](CCc1ccccc1)\C=C\[N+]([O-])=O
: