Target
Procathepsin L
Ligand
BDBM50201259
Substrate
Meas. Tech.
ChEMBL_1623051 (CHEMBL3865403)
Ki
11±n/a nM
Citation
 Latorre, ASchirmeister, TKesselring, JJung, SJohé, PHellmich, UAHeilos, AEngels, BKrauth-Siegel, RLDirdjaja, NBou-Iserte, LRodríguez, SGonzález, FV Dipeptidyl Nitroalkenes as Potent Reversible Inhibitors of Cysteine Proteases Rhodesain and Cruzain. ACS Med Chem Lett 7:1073-1076 (2016)  
Target
Name:
Procathepsin L
Synonyms:
CATL1_HUMAN CTSL CTSL1 Cathepsin L Cathepsin L1 heavy chain MEP cathepsin L preproprotein
Type:
Enzyme
Mol. Mass.:
37557.19
Organism:
Homo sapiens (Human)
Description:
Purchased from Calbiochem (San Diego, CA).
Residue:
333
  
Inhibitor
Name:
BDBM50201259
Synonyms:
CHEMBL3907022
Type:
Small organic molecule
Emp. Form.:
C21H23N3O5
Mol. Mass.:
397.4244
SMILES:
C[C@H](NC(=O)[C@H](Cc1ccccc1)NC(=O)OCc1ccccc1)\C=C\[N+]([O-])=O
: