Target
Cathepsin B
Ligand
BDBM50201211
Substrate
Meas. Tech.
ChEMBL_1623050 (CHEMBL3865402)
Ki
72±n/a nM
Citation
 Latorre, ASchirmeister, TKesselring, JJung, SJohé, PHellmich, UAHeilos, AEngels, BKrauth-Siegel, RLDirdjaja, NBou-Iserte, LRodríguez, SGonzález, FV Dipeptidyl Nitroalkenes as Potent Reversible Inhibitors of Cysteine Proteases Rhodesain and Cruzain. ACS Med Chem Lett 7:1073-1076 (2016)  
Target
Name:
Cathepsin B
Synonyms:
APP secretase CATB_HUMAN CTSB Cathepsin B light chain | Cathepsin B1
Type:
Enzyme
Mol. Mass.:
37819.69
Organism:
Homo sapiens (Human)
Description:
gi_63102437
Residue:
339
  
Inhibitor
Name:
BDBM50201211
Synonyms:
CHEMBL3930083
Type:
Small organic molecule
Emp. Form.:
C25H31N3O5
Mol. Mass.:
453.5307
SMILES:
CC(C)C[C@H](NC(=O)OCc1ccccc1)C(=O)N[C@@H](CCc1ccccc1)\C=C\[N+]([O-])=O
: