Target
Probable G-protein coupled receptor 142
Ligand
BDBM50201579
Substrate
Meas. Tech.
ChEMBL_1623125 (CHEMBL3865477)
EC50
>20000±n/a nM
Citation
 Guo, LParker, DLZang, YSweis, RFLiu, WSherer, ECBuist, NTerebetski, JKelly, TBugianesi, RPriest, BTDingley, KHLi, XMitelman, SSalituro, GTrujillo, MEPachanski, MKirkland, MPowles, MAEiermann, GJFeng, YShang, JHoward, ADUjjainwalla, FSinz, CJDebenham, JSEdmondson, SDNargund, RPHagmann, WKLi, D Discovery and Optimization of a Novel Triazole Series of GPR142 Agonists for the Treatment of Type 2 Diabetes. ACS Med Chem Lett 7:1107-1111 (2016)  
Target
Name:
Probable G-protein coupled receptor 142
Synonyms:
G-protein coupled receptor PGR2 GPR142 | PGR2
Type:
PROTEIN
Mol. Mass.:
51127.50
Organism:
Homo sapiens (Human)
Description:
ChEMBL_985961
Residue:
462
  
Inhibitor
Name:
BDBM50201579
Synonyms:
CHEMBL3963733
Type:
Small organic molecule
Emp. Form.:
C25H23N7O2
Mol. Mass.:
453.4958
SMILES:
COc1cc(ccc1-n1cnc(C)c1)-c1cn(CNC(=O)Nc2cccc3ccccc23)nn1
: